GOES-14 Imager
change note: 2018-04-05 15:13:37.0 [sritz] update WeightedRelation (Platform-Instrument); update WeightedRelation (1);
change note: 2018-04-05 15:13:06.0 [sritz] insert WeightedRelation (id: null related concept uuid: 9dfc4f09-66e5-4e70-b4f9-72f52855c9c3 relationship type: null relationship value: null generated by: null);
change note: 2018-04-05 15:08:59.0 [sritz] insert Definition (id: null text: The GOES-14 Imager is multi-purpose obtaining imagery and wind derivation by tracking clouds and water vapor features using 5 channels covering VIS, MWIR, and TIR. language code: en);
change note: 2018-04-05 15:06:29.0 [sritz] Insert Concept add broader relation (GOES-14 Imager [55461d90-0015-4d73-8ccc-16b25d9c925c,367483] - Imaging Spectrometers/Radiometers [944b7691-af37-4fb4-9393-c114e7997829,347979]);
in scheme: instruments
definition: The GOES-14 Imager is multi-purpose obtaining imagery and wind derivation by tracking clouds and water vapor features using 5 channels covering VIS, MWIR, and TIR.
type: Concept

Imaging Spectrometers/Radiometers
type: Concept