USDA/FAS/PECAD
in scheme: providers
definition: The Foreign Agricultural Service (FAS) of the U.S. Department of Agriculture (USDA) works to improve foreign market access for U.S. products, build new markets, improve the competitive position of U.S. agriculture in the global marketplace, and provide food aid and technical assistance to foreign countries. Summary provided by: http://www.fas.usda.gov/aboutfas.asp
type: Concept

USDA
type: Concept