MOUNTAIN SNOW LINE SHIFT
change note: 2012-07-26 18:41:23.0 [mpmorahan] insert Definition (id: null text: The boundary marking the lowest altitude at which a given area, such as the top of a mountain, is always covered with snow. language code: en);
change note: 2012-06-26 12:34:31.0 [gee-cee] Insert Concept add broader relation (MOUNTAIN SNOW LINE SHIFT [56e7e412-b354-4ef4-8742-f1f5681c378a,39879] - TERRESTRIAL HYDROSPHERE INDICATORS [9246fc12-17e7-4473-b9c0-c23e4bfc4eda,39869]);
in scheme: sciencekeywords
definition: The boundary marking the lowest altitude at which a given area, such as the top of a mountain, is always covered with snow.
type: Concept

TERRESTRIAL HYDROSPHERE INDICATORS
type: Concept