TECTONICS
type: Concept

CORE PROCESSES
change note: 2017-03-10 11:08:13.0 [tstevens] update Definition (Pertaining to the measurement, analysis, or modeling of the internal processes of the Earth's core and mantle.); update Definition (USGS);
in scheme: sciencekeywords
definition: Pertaining to the measurement, analysis, or modeling of the internal processes of the Earth's core and mantle.
type: Concept