AVIRIS-NG
type: Concept
change note: 2018-02-22 17:08:25.0 [sritz] update AltLabel ( Airborne Visible InfraRed Imaging Spectrometer - Next Generation);
change note: 2018-02-22 16:59:36.0 [sritz] Insert Concept add broader relation (AVIRIS-NG [57854209-ce09-4dc9-90e2-5c4e1060fdad,310587] - Imaging Spectrometers/Radiometers [944b7691-af37-4fb4-9393-c114e7997829,290619]);
change note: 2021-10-15 08:49:23.0 [tstevens] update AltLabel (Airborne Visible-Infrared Imaging Spectrometer - Next Generation);
change note: 2018-02-22 17:01:27.0 [sritz] insert AltLabel (id: null category: primary text: Airborne Visible InfraRed Imaging Spectrometer - Next Generation. language code: en); insert Definition (id: null text: The Airborne Visible-Infrared Imaging Spectrometer - Next Generation (AVIRIS-NG) has been developed to provide continued access to high signal-to-noise ratio imaging spectroscopy measurements in the solar reflected spectral range. AVIRIS-NG is expected to replace the AVIRIS-Classic instrument that has been flying since 1986. AVIRIS-NG measures the wavelength range from 380 nm to 2510 nm with 5 nm sampling. Spectra are measured as images with 600 cross-track elements and spatial sampling from 0.3 m to 4.0 m from a Twin Otter platform. In the near future, a high altitude platform (NASA's ER-2) will be available. AVIRIS-NG has better than 95% cross-track spectral uniformity and >= 95% spectral IFOV uniformity. language code: en);
in scheme: instruments
definition: The Airborne Visible-Infrared Imaging Spectrometer - Next Generation (AVIRIS-NG) has been developed to provide continued access to high signal-to-noise ratio imaging spectroscopy measurements in the solar reflected spectral range. AVIRIS-NG is expected to replace the AVIRIS-Classic instrument that has been flying since 1986. AVIRIS-NG measures the wavelength range from 380 nm to 2510 nm with 5 nm sampling. Spectra are measured as images with 600 cross-track elements and spatial sampling from 0.3 m to 4.0 m from a Twin Otter platform. In the near future, a high altitude platform (NASA's ER-2) will be available. AVIRIS-NG has better than 95% cross-track spectral uniformity and >= 95% spectral IFOV uniformity.

Imaging Spectrometers/Radiometers
type: Concept