NY/CLIM
in scheme: providers
definition: The New York State Climatologist is a partner of a national climate service program that includes the National Climatic Data Center, Regional Climate Centers, and State Climate Offices. "http://nysc.eas.cornell.edu/" [Extracted from the New York State Climate Office homepage]
type: Concept

NEW YORK
type: Concept