AUGUSTANA/GEOL
in scheme: providers
definition: The Geology Department faculty are all engaged in active research, much of which is funded by the National Science Foundation (NSF), including Research Experiences for Undergraduates (REU) funded projects. This provides many opportunities for student participation in research during the summer and school year. Research projects vary with student interest and funding, however recent projects have included research in experimental petrology, paleontology, geomorphology, hydrogeology, and glacial geology. Website: "http://www.augustana.edu/academ/geology/index.htm" [Summary provided by Augustana College.]
type: Concept

ACADEMIC
type: Concept