UCHILE/FCFM/DFI
in scheme: providers
definition: The Faculty of Mathematics and Physical Sciences at the University of Chile imparts higher education in 10 specialities of Civil Engineering, Geology, 4 degrees in science, and more than 30 graduate academic programs. Esta Facultad se caracteriza porque en ella se cultivan y desarrollan las ciencias básicas, las ciencias de la ingeniería y las aplicaciones tecnológicas, lo que la convierte en una institución única y atípica en su género. This School is characterized in that it grow and develop the basic sciences, engineering sciences and technological applications, which makes it a unique institution and atypical of its kind. Summary Provided By: http://translate.google.com/translate?hl=en&sl=es&u=http://ingenieria.uchile.cl/&sa=X&oi=translate&resnum=1&ct=result&prev=/search%3Fq%3DFacultad%2Bde%2BCiencias%2BFisicas%2By%2BMatematicas,%2BUniversidad%2Bde%2BChile,%2B%2BChile%26hl%3Den%26client%3Dfirefox-a%26rls%3Dorg.mozilla:en-US:official%26hs%3DvSx%26sa%3DG
type: Concept

ACADEMIC
type: Concept