CCAWS
in scheme: projects
definition: The Cryospheric Change Analysis Web Services (CCAWS) project is developing a scalable cryospheric analysis portal for the study of Greenland's ice mass balance. This portal will include interactive data analysis tools, seamless data access, and interoperable information services. To make this possible, a set of existing subsetting, gridding, projection, and visualization tools at NSIDC will be made into modular Web services. Also, as part of this project, NSIDC will bring in several new data sets. [Summary provided by NSIDC.] https://nsidc.org/research/projects/Stroeve_Cryospheric_Change_Analysis.html
type: Concept

A - C
type: Concept