NASA/GSFC/EOS/ESDIS/LANCE MODIS
change note: 2019-04-08 11:45:27.0 [sritz] Insert Concept add broader relation (NASA/GSFC/EOS/ESDIS/LANCE MODIS [593ea562-e43b-4e75-af24-e3723cb70ee8,368633] - NASA [4fd0aa9d-1a80-4dde-8452-c69b5c4d08cc,337191]);
change note: 2019-04-08 11:46:31.0 [sritz] insert AltLabel (id: null category: primary text: Land, Atmosphere Near real-time Capability for EOS (LANCE) Moderate Resolution Imaging Spectroradiometer (MODIS) language code: en); insert Resource (id: null type: provider url: https://earthdata.nasa.gov/earth-observation-data/near-real-time/download-nrt-data/modis-nrt);
change note: 2019-04-08 11:56:33.0 [sritz] insert Definition (id: null text: The LANCE-MODIS data system operated by the GSFC Terrestrial Information Systems Laboratory, Code 619. LANCE-MODIS provides certain Aqua and Terra MODIS L0, L1, L2, L2G, L3 products, and NPP/JPSS1 VIIRS L1 and L2 products on a near-real-time basis. language code: en);
in scheme: providers
type: Concept
definition: The LANCE-MODIS data system operated by the GSFC Terrestrial Information Systems Laboratory, Code 619. LANCE-MODIS provides certain Aqua and Terra MODIS L0, L1, L2, L2G, L3 products, and NPP/JPSS1 VIIRS L1 and L2 products on a near-real-time basis.

NASA
type: Concept