MULTINATIONAL ORGANIZATIONS
type: Concept

UN/CSB
in scheme: providers
definition: The United Nations Cyberschoolbus was created in 1996 as the online education component of the Global Teaching and Learning Project, whose mission is to promote education about international issues and the United Nations. The Global Teaching and Learning Project produces high quality teaching materials and activities designed for educational use (at primary, intermediate and secondary school levels) and for training teachers. The vision of this Project is to provide exceptional educational resources (both online and in print) to students growing up in a world undergoing increased globalization. The Global Teaching and Learning Project is part of the Outreach Division of the United Nations Department of Public Information. Summary provided by: http://www.un.org/Pubs/CyberSchoolBus/miss.html
type: Concept