MULTINATIONAL ORGANIZATIONS
type: Concept

SDLS
in scheme: providers
definition: The Antarctic Seismic Data Library System provides open access worldwide to Antarctic multichannel seismic-reflection data collected by many countries to study the structure of the earth's crust of Antarctica. This page provides links to answers for many common questions about the SDLS, and how the library system can be used by all researchers. Summary Provided By: http://walrus.wr.usgs.gov/sdls/
type: Concept