G - I
type: Concept

GLUES
change note: 2014-05-14 09:14:50.0 [128.183.164.42] added user project insert AltLabel (id: null text: Global Assessment of Land Use Dynamics, Greenhouse Gas Emissions and Ecosystem Services language code: en); insert Definition (id: null text: Within the project GLUES (Global Assessment of Land Use Dynamics, Greenhouse Gas Emissions and Ecosystem Services, 2010-2014) the Professorship of Geoinformation Systems of the TU Dresden is implementing a Geodata Infrastructure (GDI). The GLUES GDI is the common data and service platform for the international research program 'Sustainable Land Management', but it can also be used by other researchers and stakeholders. The GLUES GDI provides global and regional data sets about land use, climate change, economical change, greenhouse gas emissions, biodiversity and ecosystem services. The GDI realizes a network of Web services enabling standardised access to distributed geodata bases and analysis functions. language code: en);
change note: 2014-05-14 09:13:33.0 [128.183.164.42] Insert Concept add broader relation (GLUES [5c0d34fc-09f0-4fcc-9c8b-6c9f444129ee,106383] - G - I [af0968ce-ffe3-44a0-86de-2ec9b9a8fa5d,77509]);
in scheme: projects
definition: Within the project GLUES (Global Assessment of Land Use Dynamics, Greenhouse Gas Emissions and Ecosystem Services, 2010-2014) the Professorship of Geoinformation Systems of the TU Dresden is implementing a Geodata Infrastructure (GDI). The GLUES GDI is the common data and service platform for the international research program 'Sustainable Land Management', but it can also be used by other researchers and stakeholders. The GLUES GDI provides global and regional data sets about land use, climate change, economical change, greenhouse gas emissions, biodiversity and ecosystem services. The GDI realizes a network of Web services enabling standardised access to distributed geodata bases and analysis functions.
type: Concept