CA/INAC/WRD
in scheme: providers
definition: In the Northwest Territories, the Department of Indian Affairs and Northern Development (DIAND) has a wide variety of responsibilities. Land, water and resource management are coordinated through the region's operational directorates which include: Mineral and Petroleum Resources, Pipeline Readiness Office, Operations, Contaminants and Renewable Resources and Environment. Summary Provided By: http://nwt-tno.inac-ainc.gc.ca/ov_e.htm
type: Concept

CANADA
type: Concept