THERMAL CONDUCTIVITY
in scheme: sciencekeywords
definition: A measure of the ability of a soil to transfer heat (through a unit thickness, across a unit area for a unit difference in temperature).
type: Concept

SOILS
type: Concept