SURFACE WATER PROCESSES/MEASUREMENTS
type: Concept

STAGE HEIGHT
change note: 2016-04-04 09:33:53.0 [gee-cee] update Definition (The elevation of the water level of a lake, river, stream or other body of water above a common datum.); update Definition (Goudie, Andrew. 1997. The Encyclopedic Dictionary of Physical Geography. Blackwell Publishing, Malden, Massachusetts. );
change note: 2016-03-31 08:14:15.0 [gee-cee] Move Concepts delete broader relation (null); add broader relation (STAGE HEIGHT [5cb5d5b9-0c0b-497f-a4ea-a8cece52d13d,86183] - SURFACE WATER PROCESSES/MEASUREMENTS [9d86cd70-062a-4c39-b3f3-226abebc07f7,158723]);
in scheme: sciencekeywords
definition: The elevation of the water level of a lake, river, stream or other body of water above a common datum.
type: Concept