DIMETHYL SULFIDE
in scheme: sciencekeywords
definition: Dimethyl sulfide (DMS) is released by bacteria on the continents and in the oceans. Oxidized in the marine atmosphere to partially form cloud condensation nuclei and this may effect the formation of clouds over the oceans. [Nature; v326, 655, 1987.] [Nature; v237, 452, 1972.]
type: Concept

SULFUR COMPOUNDS
type: Concept