LANDSAT-9
change note: 2019-12-31 16:59:57.0 [sritz] Insert Concept add broader relation (LANDSAT-9 [5d3ce672-39fb-4dd5-be5e-55f81fb7f40f,559589] - LANDSAT [3cc4a1e8-3b94-4567-90b3-32137aec2d9e,541561]);
change note: 2019-12-31 17:01:32.0 [sritz] insert Definition (id: null text: Landsat 9—a partnership between NASA and the U.S. Geological Survey— will continue the Landsat program’s critical role in monitoring, understanding and managing the land resources needed to sustain human life. Today’s increased rates of global land cover and land use change have profound consequences for weather and climate change, ecosystem function and services, carbon cycling and sequestration, resource management, the national and global economy, human health, and society. Landsat is the only U.S. satellite system designed and operated to repeatedly observe the global land surface at a moderate scale that shows both natural and human-induced change. Landsat 9 has been fast-tracked for a December 2020 launch. More Information: https://landsat.gsfc.nasa.gov/landsat-9/ https://www.usgs.gov/land-resources/nli/landsat/landsat-9 language code: en);
change note: 2021-07-23 17:01:39.0 [sritz] insert AltLabel (id: null category: primary text: LANDSAT-9 language code: en);
definition: Landsat 9—a partnership between NASA and the U.S. Geological Survey— will continue the Landsat program’s critical role in monitoring, understanding and managing the land resources needed to sustain human life. Today’s increased rates of global land cover and land use change have profound consequences for weather and climate change, ecosystem function and services, carbon cycling and sequestration, resource management, the national and global economy, human health, and society. Landsat is the only U.S. satellite system designed and operated to repeatedly observe the global land surface at a moderate scale that shows both natural and human-induced change. Landsat 9 has been fast-tracked for a December 2020 launch. More Information: https://landsat.gsfc.nasa.gov/landsat-9/ https://www.usgs.gov/land-resources/nli/landsat/landsat-9
type: Concept
in scheme: platforms

Landsat
type: Concept