METAMORPHIC ROCKS
type: Concept

METAMORPHIC ROCK VERTICAL/GEOGRAPHIC DISTRIBUTION
change note: 2013-03-14 14:16:39.0 [tbs1979] insert Definition (id: null text: The vertical and geographic distribution of metamorphic rocks within the solid Earth. language code: en);
change note: 2013-03-05 11:02:34.0 [tbs1979] Insert Concept add broader relation (METAMORPHIC ROCK VERTICAL/GEOGRAPHIC DISTRIBUTION [5d80d2d2-7841-4734-a8c5-5d60679e3830,82981] - METAMORPHIC ROCKS [d220bbb1-410e-4b77-9663-78cb68c6b134,63987]);
in scheme: sciencekeywords
definition: The vertical and geographic distribution of metamorphic rocks within the solid Earth.
type: Concept