G - I
type: Concept

GPS/MET
in scheme: projects
definition: "GPS Meteorology" is a name given to the body of science and technology which makes use of the Global Positioning System (GPS) for active remote sensing of the Earth atmosphere. At the University Corporation for Atmospheric Research (UCAR), scientists have already demonstrated one GPS Meteorology technique using ground based GPS receivers.[1] "Ground based GPS Meteorology is capable of accurate, continuous, integrated precipitable water vapor measurements at fixed sites. In the near future, a UCAR lead team intends to demonstrate an active limb sounding technique using radio occultation observations taken by an orbiting GPS receiver. We refer to this program and the technology under development collectively as "GPS/MET". The primary GPS/MET Program objectives are: (1) to construct a system and use it to collect GPS occultation data, (2) to develop and demonstrate algorithms for the recovery of accurate refractivity profiles and derivative products, such as pressure, temperature and moisture profiles, (3) to evaluate the net impact of GPS/MET occultation data on weather forecasts and global change research, and (4) to publish GPS/MET data in forms useful to other scientists investigating meteorological and related applications. Note that GPS/MET promises to produce high quality data for two of the key global change variables identified by the Committee on Earth and Environmental Sciences: atmospheric temperature and moisture distribution. Moreover, the goals for GPS/MET address specific objectives identified in NOAA's 1992 Strategic Plan for Upper- Air Observations. If successful, this proof- of- concept demonstration could pave the way for a new, low cost operational sounding system capable of thousands of globally distributed soundings per day. To achieve these objectives quickly and inexpensively, a modified commercial GPS receiver will be flown on a host satellite as a secondary payload. Launch of this satellite, the MicroLab-1, is scheduled for Fall, 1994. GPS o…
type: Concept