ISOSTATIC ADJUSTMENTS
change note: 2013-03-11 15:45:13.0 [tbs1979] insert Definition (id: null text: The rise of land masses that were depressed by the huge weight of ice sheets during the last glacial period, through a process known as isostasy. language code: en);
change note: 2013-02-18 09:18:43.0 [tbs1979] Insert Concept add broader relation (ISOSTATIC ADJUSTMENTS [5dee7d0e-e13e-4974-9750-79d5cd886c7a,82377] - CRUSTAL MOTION [122f7d15-7e5c-4249-992c-c753c80cf05b,62963]);
in scheme: sciencekeywords
definition: The rise of land masses that were depressed by the huge weight of ice sheets during the last glacial period, through a process known as isostasy.
type: Concept

CRUSTAL MOTION
type: Concept