GPS
type: Concept

Hemisphere VS1000
type: Concept
change note: 2023-03-10 16:23:39.0 [sritz] insert AltLabel (id: null category: primary text: Hemisphere VS1000 GPS System language code: en);
change note: 2023-03-10 13:28:10.0 [sritz] insert Definition (id: null text: The Vector™ VS1000 is Hemisphere GNSS’ premiere multi-GNSS, multi-frequency receiver designed specifically for the professional marine market. Providing precise heading, Athena RTK positioning, and full Atlas capability, its rugged design is compliant to 60529:2013 IP67 and IEC 60945:2002 8.7 standards. language code: en);
change note: 2023-03-10 13:27:12.0 [sritz] Insert Concept add broader relation (Hemisphere VS1000 [5e622fce-24da-4349-ade8-abf6886ed868,1246970] - GPS [47d0c7c0-683c-42a9-b53b-53b684972b52,1238232]);
definition: The Vector™ VS1000 is Hemisphere GNSS’ premiere multi-GNSS, multi-frequency receiver designed specifically for the professional marine market. Providing precise heading, Athena RTK positioning, and full Atlas capability, its rugged design is compliant to 60529:2013 IP67 and IEC 60945:2002 8.7 standards.
in scheme: instruments