SNOW DENSITY CUTTER
change note: 2021-08-05 17:09:56.0 [sritz] insert AltLabel (id: null category: primary text: SNOW DENSITY CUTTER language code: en);
in scheme: instruments
definition: A Snow Density Cutter is a metal device that cuts out exactly 100 cubic centimeters of snow. The metal device is then placed on the balance and the snow's mass is recorded. The snow density can be calculated by dividing the mass by its volume. [Source: Teachers Experiencing Antarctica and the Arctic]
type: Concept

Corers
type: Concept