FERNS AND ALLIES
type: Concept

HORSETAILS
change note: 2017-03-15 11:16:03.0 [mgenazzi] Definition added insert Definition (id: null text: Class Polypodiopsida. Order Equisetales. Horsetails is in a family of vascular plants, reproduces by spores, with reduced non-photosynthetic leaves and a microphyllis language code: en);
in scheme: sciencekeywords
definition: Class Polypodiopsida. Order Equisetales. Horsetails is in a family of vascular plants, reproduces by spores, with reduced non-photosynthetic leaves and a microphyllis
type: Concept