NOAA
type: Concept

DOC/NOAA/OMAO
in scheme: providers
definition: NOAA's Office of Marine and Aviation Operations (OMAO) operates a wide variety of specialized aircraft and ships to complete NOAA's environmental and scientific missions. OMAO is also responsible for the administration and implementation of the NOAA Diving Program, Small Boat Program and Aviation Safety Program, to ensure safe and efficient operations in NOAA-sponsored underwater activities and aviation and small boat operations.
type: Concept