DUKE/BIO
in scheme: providers
definition: The Duke University Department of Biology conducts research on genomics, cell and molecular biology, developmental biology, ecology and population biology, evolution, genetics, organismal biology and behavior and systematics. Website: "http://www.biology.duke.edu/" [Summary provided by Duke University.]
type: Concept

ACADEMIC
type: Concept