TIROS
change note: 2021-11-30 09:36:20.0 [tstevens] Move Concepts delete broader relation (null); add broader relation (TIROS [6096b1ec-25d5-4b9b-9358-a17d8b481646,826302] - TIROS [75b34f33-a790-4164-9cc0-02a997279e61,826385]);
change note: 2021-11-30 09:34:39.0 [tstevens] Move Concepts delete broader relation (null); add broader relation (TIROS [6096b1ec-25d5-4b9b-9358-a17d8b481646,826302] - Earth Observation Satellites [3466eed1-2fbb-49bf-ab0b-dc08731d502b,826121]);
in scheme: platforms
definition: The objectives of TIROS (Television Infrared Observation Satellite) was to test experimental television techniques designed to develop a worldwide meteorological satellite information system. The spacecraft was 42 inches in diameter, 19 inches high and weighed 270 pounds. The craft was made of aluminum alloy and stainless steel which was then covered by 9200 solar cells. The solar cells served to charge the on-board batteries. Three pairs of solid-propellant spin rockets were mounted on the base plate. Two television cameras were housed in the craft, one low-resolution and one high-resolution. A magnetic tape recorder for each camera was supplied for storing photographs while the satellite was out of range of the ground station network. The antennas consisted of four rods from the base plate to serve as transmitters and one vertical rod from the center of the top plate to serve as a receiver. The craft was spin-stabilized and space-oriented (not Earth-oriented). Therefore, the cameras were only operated while they were pointing at the Earth when that portion of the Earth was in sunlight. The video systems relayed thousands of pictures containing cloud-cover views of the Earth. Early photographs provided information concerning the structure of large-scale cloud regimes. For more information, link to "http://www.earth.nasa.gov/history/tiros/tiros1.html" [Summary provided by NASA] Group: Platform_Details Entry_ID: TIROS Group: Platform_Identification Platform_Category: Earth Observation Satellites Platform_Series_or_Entity: TIROS Short_Name: TIROS Long_Name: Television Infrared Observation Satellite End_Group Group: Synonymous_Platform_Names Short_Name: TIROS-1 End_Group Creation_Date: 2007-11-14 Online_Resource: http://www.earth.nasa.gov/history/tiros/tiros1.html Sample_Image: http://www.nasm.si.edu/exhibitions/lae/images/LE410L8.jpg Group: Platform_Logistics Launch_Date: 1960-04-01 Primary_Sponsor: NASA End_Group End_Group
type: Concept

Television Infrared Observation Satellite (TIROS)
type: Concept