IN/PURDUE/CLIM
change note: 2021-06-18 16:38:49.0 [sritz] update Definition (The Indiana State Climate Office (INClimate) is the state archive of official daily and hourly weather observations recorded throughout Indiana. INClimate maintains an online archive of many recent daily and hourly observations from both manual and automated networks. Older observations are being converted to an online database as part of an ongoing national effort. INClimate was established in 1956 to document and study the climate of Indiana. Ever since, it has been catering to the needs of different users, namely individuals, businesses, and government agencies. INClimate not only assists in providing climate observations and summaries but also interprets and applies this data to solve climate related problems at hand. Primary users of Climate data belong to sectors such as agriculture, attorneys, construction, environmental monitoring, forensics, government insurance, news media, research, education and utilities.); update Definition (https://ag.purdue.edu/indiana-state-climate/); update Resource (provider); update Resource (https://ag.purdue.edu/indiana-state-climate/);
in scheme: providers
definition: The Indiana State Climate Office (INClimate) is the state archive of official daily and hourly weather observations recorded throughout Indiana. INClimate maintains an online archive of many recent daily and hourly observations from both manual and automated networks. Older observations are being converted to an online database as part of an ongoing national effort. INClimate was established in 1956 to document and study the climate of Indiana. Ever since, it has been catering to the needs of different users, namely individuals, businesses, and government agencies. INClimate not only assists in providing climate observations and summaries but also interprets and applies this data to solve climate related problems at hand. Primary users of Climate data belong to sectors such as agriculture, attorneys, construction, environmental monitoring, forensics, government insurance, news media, research, education and utilities.
type: Concept

INDIANA
type: Concept