SPECIES COMPETITION
in scheme: sciencekeywords
definition: Competition is the interaction of two species where they both use the same limited resource or harm one another while seeking a resource.
type: Concept

SPECIES/POPULATION INTERACTIONS
type: Concept