DATA APPLICATION SERVICES
type: Concept

GEOGRAPHIC DATA EXTRACTION SERVICES
in scheme: sciencekeywords
definition: Services that allow a user to extract and edit feature data, interacting with images and feature data.
type: Concept