EPA/ORD/NERL/CREM
in scheme: providers
definition: EPA’s Council for Regulatory Environmental Modeling (CREM) was established in 2000 to promote consistency and consensus among environmental model developers and users. The CREM council consists of senior managers from across the Agency, while CREM workgroup members consist of modelers and scientists from the program offices and regions. Summary provided by http://www.epa.gov/osainter/crem/index.html
type: Concept

EPA
type: Concept