NASA/GSFC/SED/ESD/HBSL/BISB/MODAPS_SERVICES
change note: 2017-06-12 14:28:59.0 [sritz] update Definition (Welcome to the MODIS Adaptive Processing System (MODAPS) Services website. The website is intended to provide user information concerning all aspects of MODAPS data production, archive, and distribution. The website is a companion to LAADS Web, which provides access to the data products archived by MODAPS in the Level 1 and Atmospheres Archive and Distribution System (LAADS). https://modaps.modaps.eosdis.nasa.gov/);
change note: 2017-06-12 14:28:39.0 [sritz] update Definition (Welcome to the MODIS Adaptive Processing System (MODAPS) Services website. The website is intended to provide user information concerning all aspects of MODAPS data production, archive, and distribution. The website is a companion to LAADS Web, which provides access to the data products archived by MODAPS in the Level 1 and Atmospheres Archive and Distribution System (LAADS).);
in scheme: providers
definition: Welcome to the MODIS Adaptive Processing System (MODAPS) Services website. The website is intended to provide user information concerning all aspects of MODAPS data production, archive, and distribution. The website is a companion to LAADS Web, which provides access to the data products archived by MODAPS in the Level 1 and Atmospheres Archive and Distribution System (LAADS). https://modaps.modaps.eosdis.nasa.gov/
type: Concept

NASA
type: Concept