UNM/CWE
definition: The mission of the Center for Water and the Environment is to increase the participation of underrepresented minorities (URM) in science, technology, engineering and math (STEM) professions while conducting cutting-edge research into technological and engineering-based solutions to problems with water and the environment, in a framework that considers the social, economic, policy, regulatory, and legal implications. Practical solutions to problems related to water availability in arid environments and in times of drought, and problems associated with energy generation and consumption are particularly relevant to the Center’s mission, in light of the criticality of these issues to the state of New Mexico, the southwestern United States, and their global importance.
in scheme: providers
type: Concept
change note: 2021-05-12 16:37:35.0 [sritz] insert AltLabel (id: null category: primary text: Center for Water and the Environment, University of New Mexico language code: en);
change note: 2021-05-12 16:35:46.0 [sritz] Insert Concept add broader relation (UNM/CWE [627e88bc-5d2f-4b61-99cd-56d649ede7cf,606939] - ACADEMIC [7700280b-68ee-4644-bf5e-84e7a6adf897,593506]);
change note: 2021-05-12 16:38:38.0 [sritz] update Definition (The mission of the Center for Water and the Environment is to increase the participation of underrepresented minorities (URM) in science, technology, engineering and math (STEM) professions while conducting cutting-edge research into technological and engineering-based solutions to problems with water and the environment, in a framework that considers the social, economic, policy, regulatory, and legal implications. Practical solutions to problems related to water availability in arid environments and in times of drought, and problems associated with energy generation and consumption are particularly relevant to the Center’s mission, in light of the criticality of these issues to the state of New Mexico, the southwestern United States, and their global importance.);
change note: 2021-05-12 16:36:45.0 [sritz] insert Definition (id: null text: Center for Water and the Environment, University of New Mexico language code: en);

ACADEMIC
type: Concept