COASTAL PROCESSES
type: Concept

SUSPENSION
change note: 2013-08-20 10:03:25.0 [tbs1979] insert Definition (id: null text: A heterogeneous fluid containing solid particles that are sufficiently large for sedimentation. language code: en);
change note: 2013-08-06 08:40:40.0 [tbs1979] Insert Concept add broader relation (SUSPENSION [62ecfc64-48d0-4373-9c44-599471703cf4,105587] - COASTAL PROCESSES [e26803a0-82ea-40c4-a41a-9e222c9bd09a,86507]);
in scheme: sciencekeywords
definition: A heterogeneous fluid containing solid particles that are sufficiently large for sedimentation.
type: Concept