ATMOSPHERIC ELECTRICITY
type: Concept

LIGHTNING
in scheme: sciencekeywords
definition: Generally, any and all of the various forms of visible electrical discharge produced by thunderstorms.
type: Concept