ESTUARY
type: Concept

MANGROVE SWAMP
change note: 2016-06-14 11:31:36.0 [gee-cee] insert Definition (id: null text: Pertaining to tropical and subtropical swamps dominated by mangrove trees. language code: en);
change note: 2016-06-14 11:31:08.0 [gee-cee] Insert Concept add broader relation (MANGROVE SWAMP [63cd8427-07bd-4a46-b725-ca65da4bf9b6,188227] - ESTUARINE HABITAT [5a1ebca4-057d-43b9-af6a-04f57b93f8bb,84263]);
in scheme: sciencekeywords
definition: Pertaining to tropical and subtropical swamps dominated by mangrove trees.
type: Concept