NSF
type: Concept

UCAR/NCAR/HAO/CEDAR
in scheme: providers
definition: Coupling, Energetics and Dynamics of Atmospheric Regions (CEDAR) is a focused Global Change program sponsored by the National Science Foundation (NSF). The scientific objectives of the program are described in the CEDAR Phase III document (1.8 meg, acrobat reader required). The CEDAR Database (formerly the Incoherent Scatter Radar Database) is a cooperative project between the High Altitude Observatory (HAO) division of the National Center for Atmospheric Research (NCAR), the National Science Foundation (NSF), and several institutions that provide upper atmosphere data and model output for community use. The CEDAR Steering Committee consists of representatives from the community and NSF and meets twice a year. Read more about the community in the latest CEDAR POST. Website: "http://cedarweb.hao.ucar.edu/" [Summary provided by UCAR.]
type: Concept