GHGSat-C2
in scheme: platforms
definition: In order to expand satellite system capacity after the successful launch of its demonstration satellite, GHGSat started the design of two (2) additional high-resolution satellites in January 2017, called GHGSat-C1 ("Iris") and GHGSat-C2 ("Hugo"), respectively. GHGSat-C1/-C2 are intended to have similar designs to GHGSat-D, while applying critical lessons learned to improve performance.
change note: 2020-06-25 08:30:40.0 [mmorahan] insert AltLabel (id: null category: primary text: Greenhouse Gas Satellite - C2 language code: en);
change note: 2020-06-25 08:29:12.0 [mmorahan] Insert Concept add broader relation (GHGSat-C2 [6564cc55-1032-4e52-b1d4-b177224d3805,560488] - GHGSat [82823ffa-e4d5-4877-bf0a-b9eb5b8c1108,560482]);
change note: 2020-06-25 08:31:48.0 [mmorahan]
change note: 2020-06-25 13:03:03.0 [mmorahan] insert WeightedRelation (id: null related concept uuid: 28a3ae40-6383-47e3-a1b8-a9f6503c5fd5 relationship type: null relationship value: null generated by: null);
change note: 2020-06-25 12:07:28.0 [mmorahan] insert Definition (id: null text: In order to expand satellite system capacity after the successful launch of its demonstration satellite, GHGSat started the design of two (2) additional high-resolution satellites in January 2017, called GHGSat-C1 ("Iris") and GHGSat-C2 ("Hugo"), respectively. GHGSat-C1/-C2 are intended to have similar designs to GHGSat-D, while applying critical lessons learned to improve performance. language code: en);
type: Concept

GHGSat
type: Concept