Axiom Data Science
change note: 2017-05-31 11:45:50.0 [sritz] S. Ritz added new keyword at the request of Anna Milan insert Definition (id: null text: Axiom Data Science is an informatics and software development firm focused on developing scalable solutions which can be leveraged across a variety of users, clients and institutions in order to make the best tools for data management, integration, and visualization. We support a variety of federal, private, academic and non-governmental organizations managing and conducting research in the ecological, geological and ocean sciences. language code: en);
change note: 2017-05-31 11:44:19.0 [sritz] Insert Concept add broader relation (Axiom Data Science [65cc9f35-9928-4f41-8756-61dc452482d5,309611] - COMMERCIAL [1bb6821d-8534-40ce-a6ee-7c88ce4d3c9f,280065]);
in scheme: providers
definition: Axiom Data Science is an informatics and software development firm focused on developing scalable solutions which can be leveraged across a variety of users, clients and institutions in order to make the best tools for data management, integration, and visualization. We support a variety of federal, private, academic and non-governmental organizations managing and conducting research in the ecological, geological and ocean sciences.
type: Concept

COMMERCIAL
type: Concept