NCA-LDAS
definition: The National Climate Assessment - Land Data Assimilation System (NCA-LDAS) is one of NASA's contributions to the National Climate Assessment of the United States. The NCA-LDAS is led by scientists at NASA Goddard Space Flight Center's Hydrological Sciences Laboratory. More information: https://ldas.gsfc.nasa.gov/nca-ldas
in scheme: projects
change note: 2020-04-13 14:50:58.0 [sritz] insert AltLabel (id: null category: primary text: National Climate Assessment - Land Data Assimilation System language code: en);
change note: 2020-04-13 14:51:43.0 [sritz] insert Definition (id: null text: The National Climate Assessment - Land Data Assimilation System (NCA-LDAS) is one of NASA's contributions to the National Climate Assessment of the United States. The NCA-LDAS is led by scientists at NASA Goddard Space Flight Center's Hydrological Sciences Laboratory. More information: https://ldas.gsfc.nasa.gov/nca-ldas language code: en);
change note: 2020-04-13 14:49:15.0 [sritz] Insert Concept add broader relation (NCA-LDAS [65e710ad-4e67-4b81-be41-e3ef8054c691,559897] - M - O [a31c2828-9b6d-44e9-b6ad-7ae81030f322,548709]);
type: Concept

M - O
type: Concept