DOI/USGS/WRD/
change note: 2013-02-13 09:31:37.0 [tbs1979] Insert Concept add broader relation (DOI/USGS/WRD/ [6701a378-6781-42f9-8a7a-3d27e07f9083,82173] - USGS [5fea4160-25a7-44b5-bfba-ef140fdffaf4,66487]);
in scheme: providers
definition: Water is one of six science mission areas of the U.S. Geological Survey (USGS). Water's mission is to collect and disseminate reliable, impartial, and timely information that is needed to understand the Nation's water resources. The USGS Water Mission Area actively promotes the use of this information by decision makers to: - Minimize loss of life and property as a result of water-related natural hazards, such as floods, droughts, and land movement. - Effectively manage groundwater and surface-water resources for domestic, agricultural, commercial, industrial, recreational, and ecological uses. - Protect and enhance water resources for human health, aquatic health, and environmental quality. - Contribute to the wise physical and economic development of our Nation's resources for the benefit of present and future generations. [Summary provided by the U.S. Geological Survey.]
type: Concept

USGS
type: Concept