GOSAT-2
definition: GOSAT-2 is a follow-on Japanese mission of GOSAT/Ibuki. The experiences gained from the operation of the GOSAT mission with regard to payload calibration and validation activities served as input for the requirements of the GOSAT-2 mission. GOSAT-2 was launched on 29 October 2018. The goals for the GOSAT-2 are to measure carbon dioxide at 0.5 ppm and methane at 5 ppb at a 500 km mesh. Developers have also enhanced the satellite's focused, target-point observation capabilities, enabling the device to gather accurate readings from a broader range of target points - an ability that will be especially beneficial in evaluations of industrial areas, densely populated areas, and other areas with large quantities of greenhouse gas emissions. In another improvement over its predecessor, the GOSAT-2 is also capable of monitoring carbon monoxide concentrations.
change note: 2020-06-24 15:22:57.0 [mmorahan] insert AltLabel (id: null category: primary text: Green-house gas Observing Satellite - 2 language code: en); insert Definition (id: null text: GOSAT-2 is a follow-on Japanese mission of GOSAT/Ibuki. The experiences gained from the operation of the GOSAT mission with regard to payload calibration and validation activities served as input for the requirements of the GOSAT-2 mission. GOSAT-2 was launched on 29 October 2018. The goals for the GOSAT-2 are to measure carbon dioxide at 0.5 ppm and methane at 5 ppb at a 500 km mesh. Developers have also enhanced the satellite's focused, target-point observation capabilities, enabling the device to gather accurate readings from a broader range of target points - an ability that will be especially beneficial in evaluations of industrial areas, densely populated areas, and other areas with large quantities of greenhouse gas emissions. In another improvement over its predecessor, the GOSAT-2 is also capable of monitoring carbon monoxide concentrations. language code: en);
change note: 2020-06-24 15:20:18.0 [mmorahan] Insert Concept add broader relation (GOSAT-2 [67c230f3-5587-4f74-84d1-4c24a74276e4,560476] - Earth Observation Satellites [3466eed1-2fbb-49bf-ab0b-dc08731d502b,541501]);
change note: 2020-06-24 16:15:05.0 [mmorahan] insert WeightedRelation (id: null related concept uuid: da57ac0a-e5ab-47f4-996f-06c12e1a4a62 relationship type: null relationship value: null generated by: null); insert WeightedRelation (id: null related concept uuid: e1d8d749-9818-4ddf-8f61-14ef63b6ce7b relationship type: null relationship value: null generated by: null);
in scheme: platforms
type: Concept

Earth Observation Satellites
type: Concept