UNIVAQ/FISICA
in scheme: providers
definition: For many years the Italian University and Research is in a strong disadvantage compared to those of other European countries, we have fewer teachers, researchers and technicians, both in relation to population, both students, we spend less on education and research, for which the facilities and tools are obsolete, the costs for students are high and services are insufficient.
type: Concept

ACADEMIC
type: Concept