Profilers/Sounders
type: Concept

DROPSONDES
in scheme: instruments
definition: DROPSONDES are radiosondes with a parachute dropped form an airplane carrying receiving equipment for the purpose of obtaining an upper-air sounding during descent; also called a parachute radiosonde.
type: Concept