UMT/CFC/DECS
change note: 2014-02-26 10:37:14.0 [tbs1979] insert AltLabel (id: null text: Department of Ecosystem and Conservation Sciences, College of Forestry and Conservation, University of Montana language code: en);
change note: 2014-02-26 10:36:12.0 [tbs1979] Insert Concept add broader relation (UMT/CFC/DECS [6993ed97-ab82-4959-93fa-97508a3a3998,106169] - ACADEMIC [7700280b-68ee-4644-bf5e-84e7a6adf897,66467]);
in scheme: providers
definition: The Department of Ecosystem and Conservation Sciences (DECS) provides students with instruction and expertise in a diverse array of ecological and biophysical sciences. As a multidisciplinary department, we bring together faculty with academic training in fire science, watershed hydrology, insects and diseases, soil science, plant physiology, and wildlife biology. DECS is a rigorous, stimulating, and inspirational environment for undergraduate through doctoral students to learn about ecosystem processes and ecological function in a biologically diverse and scenic setting.
type: Concept

ACADEMIC
type: Concept