COMMERCIAL
type: Concept

ERIN
in scheme: providers
definition: ERIN Consulting Ltd. was founded in 1995 as an environmental consulting firm. We offer a wide range of environmental services to companies in Canada and the world. Our staff expertise ranges from biology to engineering and planning. Our clients include companies in oil and gas, mining, manufacturing, education, communications, public housing, and government sectors. ERIN Consulting Ltd has developed a number of significant strategic alliances with environmental industry partners. These alliances include companies with expertise in biotechnology, remote sensing, geotechnical engineering and heritage resources. This allows us to offer a full range of environmental services. Website: "http://www.erinconsulting.sk.ca/" [Summary provided by ERIN Consulting Ltd.]
type: Concept