URI/GSO
in scheme: providers
definition: The URI Graduate School of Oceanography is located on the University’s 200-acre Narragansett Bay Campus. On Narragansett Bay’s West Passage, with a deep-water pier and easy access to the open Atlantic, the campus offers an ideal location from which to explore the world ocean. Summary provided by: http://www.gso.uri.edu/about-gso/about-gso
type: Concept

ACADEMIC
type: Concept