ELECTRIC/MAGNETIC FIELD EXPOSURE
change note: 2012-07-11 09:57:28.0 [tbs1979] insert Definition (id: null text: The exposure of the magnetic field. An electric field is produced by voltage, which is the pressure used to push the electrons through the wire, much like water being pushed through a pipe. As the voltage increases, the electric field increases in strength. A magnetic field results from the flow of current through wires or electrical devices and increases in strength as the current increases. These two fields together are referred to as electric and magnetic fields, or EMFs. language code: en);
change note: 2012-06-27 14:07:56.0 [tbs1979] Insert Concept add broader relation (ELECTRIC/MAGNETIC FIELD EXPOSURE [69d84440-b806-4093-a659-f052185e22bd,40211] - ENVIRONMENTAL IMPACTS [3f4cfc81-7745-43d9-b313-f68cdf72359b,20271]);
in scheme: sciencekeywords
definition: The exposure of the magnetic field. An electric field is produced by voltage, which is the pressure used to push the electrons through the wire, much like water being pushed through a pipe. As the voltage increases, the electric field increases in strength. A magnetic field results from the flow of current through wires or electrical devices and increases in strength as the current increases. These two fields together are referred to as electric and magnetic fields, or EMFs.
type: Concept

ENVIRONMENTAL IMPACTS
type: Concept