UCLA/SAMBA
in scheme: providers
definition: The Purpose of SAMBA is to operate, and analyze data from a low-latitude meridional array of magnetometers along the coast of Chile and Antarctica. The array will be known as SAMBA (South American Meridional B-field Array) and will include 11 magnetometer sites approximately along the 0° geomagnetic longitude and ranging from -5° to -48° geomagnetic latitude. Summary Provided By: http://samba.atmos.ucla.edu/about.html
type: Concept

ACADEMIC
type: Concept