GLACIERS
type: Concept

GLACIER EXTENT
change note: 2021-08-05 15:30:08.0 [tstevens] insert Definition (id: null text: Glacier extent is a glacier outline in horizontal space separating the glacier from unglacierized terrain or, at divides, from contiguous glaciers. language code: en);
change note: 2021-08-05 15:29:31.0 [tstevens] Insert Concept add broader relation (GLACIER EXTENT [6b96d652-3c5c-48a9-9a5f-ac58ec6f9755,692292] - GLACIERS [4a426aab-4a95-4bf4-8449-19a72a251541,689824]);
in scheme: sciencekeywords
definition: Glacier extent is a glacier outline in horizontal space separating the glacier from unglacierized terrain or, at divides, from contiguous glaciers.
type: Concept